Contact Us

Home > Error Starting > Error Starting Sun Native2ascii Appfuse

Error Starting Sun Native2ascii Appfuse

java:459) at org.apache.maven.lifecycle.DefaultLifecycleExecutor.executeGoalAndHandleFailures(DefaultL ifecycleExecutor.java:311) at org.apache.maven.lifecycle.DefaultLifecycleExecutor.executeTaskSegments(DefaultLifecycleE xecutor.java:278) at org.apache.maven.lifecycle.DefaultLifecycleExecutor.execute(DefaultLifecycleExecutor.java :143) at org.apache.maven.DefaultMaven.doExecute(DefaultMaven.java:330) at org.apache.maven.DefaultMaven.execute(DefaultMaven.java:123) at org.apache.maven.cli.MavenCli.main(MavenCli.java:272) at sun.reflect.NativeMethodAccessorImpl.invoke0(Native Method) at sun.reflect.NativeMethodAccessorImpl.invoke(NativeMethodAccessorImpl.java:39) at sun.reflect.DelegatingMethodAccessorImpl.invoke(DelegatingMethodAccessorImpl.java:25) at java.lang.reflect.Method.invoke(Method.java:585) at org.codehaus.classworlds.Launcher.launchEnhanced(Launcher.java:315) at org.codehaus.classworlds.Launcher.launch(Launcher.java:255) at org.codehaus.classworlds.Launcher.mainWithExitCode(Launcher.java:430) We use Suns JVM for >> deployment >> > > > and JRockit for tests now. Here'sthestacktrace: [email protected]:~java/af/host$mvn-e-Dsurefire.useFile=false [INFO]Errorstacktracesareturnedon. [INFO]Scanningforprojects... [INFO] ------------------------------------------------------------------------ [INFO]ReactorBuildOrder: [INFO] [INFO]AppFuseModularApplication [INFO]AppFuseModularApplication-Core [INFO]AppFuseModularApplication-Web(Struts2) [INFO] [INFO] ------------------------------------------------------------------------ [INFO]BuildingAppFuseModularApplication1.0-SNAPSHOT [INFO] ------------------------------------------------------------------------ [INFO] [INFO]---maven-install-plugin:2.3.1:install(default-install)@feeder--- [INFO]Installing/home/jh321296/java/af/feeder/pom.xmlto /home/jh321296/.m2/repository/com/ep/rsid/feeder/1.0-SNAPSHOT/feeder-1.0-SNAPSHOT.pom [INFO] [INFO] ------------------------------------------------------------------------ [INFO]BuildingAppFuseModularApplication-Core1.0-SNAPSHOT [INFO] ------------------------------------------------------------------------ [INFO] [INFO]---maven-resources-plugin:2.5:resources(default-resources)@core please be kind
.I am trying to run Hudson on an application built by AppFuse and keepgetting this error. http://vgadownload.com/error-starting/ggts-error-starting-sun-39-s-native2ascii.html

I'm now getting this, which *may* relate to a bad file name, perhaps, given that I see references to a login.xmlf file (as opposed to login.xml which seems more like what However, ifyou use a scriptlet, you can use request.isUserInRole('rolename'). We use Suns JVM for deployment > > > and JRockit for tests now. GBiz is too! Latest News Stories: Docker 1.0Heartbleed Redux: Another Gaping Wound in Web Encryption UncoveredThe Next Circle of Hell: Unpatchable SystemsGit 2.0.0 ReleasedThe Linux Foundation Announces Core Infrastructure https://java.net/projects/appfuse/lists/users/archive/2012-05/message/135

I take it this 96mb is a setting specified somewhere but i don't know where? Join Now I want to fix my crash I want to help others Exception invalidated This exception was invalidated. I'm assuming you just > > > > use JRockit for your tests, but you still use Sun's JVM for "mvn > > > > jetty:run"? > > > > > I've > > > >> > heard bad things about Spring and Hibernate in the past, so I don't > > > >> > know if they're causing this or what.

FAILURE > [3:50.040s] > [INFO] > ------------------------------------------------------------------------ > [INFO] BUILD FAILURE > [INFO] > ------------------------------------------------------------------------ > [INFO] Total time: 4:09.333s > [INFO] Finished at: Thu May 31 11:43:02 PDT 2012 > I have read that this may be a result of the tools.jar being located in the jre and not the jdk path. http://old.nabble.com/Filtering-with-native2ascii-maven-plugin-td17042250.htmlI looked at the configuration in web/pom.xml, there are two "executions", and one has both includes and excludes but the other only has includes, no excludes. Should I create a action for mainManu?*Best Regards, **Tyson Cung**Hello Technology Pte.** **Ltd.*180 Cecil Street, #07-03, Bangkok Bank Building, Singapore 069546(*F* : +65 6534 7133 (*HP* : +65 93896675Yes.Hi all,Can

I'm also running the new 12.04 ubuntu > release and installing Sun's JDK is ever more "interesting" these days on > ubuntu which is irritating. > > Here's how I installed Tnx for HELP!! My guess is resources aren't being let >> go. http://appfuse.547863.n4.nabble.com/Error-starting-Sun-s-native2ascii-td4654744.html Anyideawhat'sgoingonhere?Followingisthestacktrace,it's definitelytryingtorunthisnative2asciithing,butbeyondthatI'mnot suresofar,anyhelpwouldbegreatlyappreciated!

The reason > this happened is probably because I chose *not* to use JRockit as my > default JRE. > > Matt > > On 3/8/07, Matt Raible wrote: >> Near Earth vs Newtonian gravitational potential maintaining brightness while shooting bright landscapes New tech, old clothes Are independent variables really independent? Hibernate Online Training | Java Online Training | Java EE Online Training October 6, 2016 at 1:01 AM Post a Comment Newer Post Older Post Home Subscribe to: Post Comments (Atom) On May 31, 2012, at 2:52 PM, jackalista wrote: > OK, that worked, it appears, but I hit another problem, I'm not sure if one > cascaded from the other or

Could that be the problem? http://users.appfuse.dev.java.narkive.com/bzOM73mY/appfuse-build-error Matt is correct in stating that resources are not being > > > >> released but JRockit seems to do ok in this respect. > > > >> > > > YoucouldPost by Matt Raibledo this with a scriplet or JSTL's tag. uname –a emits: FreeBSD builds.pdc4u.com 7.2-RELEASE FreeBSD 7.2-RELEASE #0: Fri May 1 08:49:13 UTC 2009 [email protected]:/usr/obj/usr/src/sys/GENERIC i386 Any direction on this is appreciated!!

the JVM can be declared in your POM under the > > > configuration for the surefire-plugin. his comment is here I tried changing the Mojo plugin since it seems like that's what's calling the native2ascii tool but that looks wrong since the current version of Mojo is 2.4, and also because Not the answer you're looking for? I was able to run "mvn jetty:run" and > compile classes (to invoke a restart) about 15 times.

The last part of the stack > trace may show the culprit, there seems to be a problem with this construct > from the login.xmlf file as ref'ed in the trace. the first error says it's a regx syntax problem, here: Caused by: /home/jh321296/java/af/feeder/web/src/test/resources/login.xmlf:2: Unexpected exception caught: java.util.regex.PatternSyntaxException and the Caused by says this: Caused by: java.util.regex.PatternSyntaxException: Illegal repetition near index 2 java:57) at sun.reflect.DelegatingMethodAccessorImpl.invoke(DelegatingMethodAcces sorImpl.java:43) at java.lang.reflect.Method.invoke(Method.java:601) at org.codehaus.plexus.classworlds.launcher.Launcher.launchEnhanced(Laun cher.java:290) at org.codehaus.plexus.classworlds.launcher.Launcher.launch(Launcher.jav a:230) at org.codehaus.plexus.classworlds.launcher.Launcher.mainWithExitCode(La uncher.java:409) at org.codehaus.plexus.classworlds.launcher.Launcher.main(Launcher.java: 352) Caused by: org.apache.maven.plugin.PluginExecutionException: Execution native2as cii-utf8 of goal org.codehaus.mojo:native2ascii-maven-plugin:1.0-alpha-1:native2 ascii failed: Error starting this contact form I'll check back next week and see how it's >> > going for everyone.

mraible Reply | Threaded Open this post in threaded view ♦ ♦ | Report Content as Inappropriate ♦ ♦ Re: Error starting Sun's native2ascii Administrator I meant changing the version ApplicationResources*.properties need to end up in this directory. > > -- > View this message in context: http://appfuse.547863.n4.nabble.com/Error-starting-Sun-s-native2ascii-tp4654744p4655180.html > Sent from the AppFuse - User mailing list archive at Nabble.com. I'm assuming you just > > > > use JRockit for your tests, but you still use Sun's JVM for "mvn > > > > jetty:run"? > > > > >

share|improve this answer answered Sep 21 '12 at 7:19 khmarbaise 46.3k772103 In my case the newest version is 1.0-beta-1 (previous 1.0-alpha-1). –Felix Apr 12 at 8:16 add a comment|

jackalista Reply | Threaded Open this post in threaded view ♦ ♦ | Report Content as Inappropriate ♦ ♦ Re: Error starting Sun's native2ascii In reply to this post by All rights reserved. I installed it about an hour >> > ago and did some testing. I gave up after > that.

more hot questions question feed default about us tour help blog chat data legal privacy policy work here advertising info mobile contact us feedback Technology Life / Arts Culture / Recreation If good, we'll change the download link to >> > JRockit on the QuickStart Guide. >> > >> > Matt >> > >> > P.S. I don't think this means you have to use JRockit for production, >> > just when you're reloading a lot during development. >> > >> > On 3/8/07, Matt Raible navigate here I installed it about an hour >> > ago and did some testing.

I gave up after >> > that. find similars Maven Core M3 Interceptor Java RT 0 Speed up your debug routine! SUCCESS [16.552s] > [INFO] AppFuse Modular Application - Web (Struts 2) ...... Or yes, you could mapmainMenu to an Action and do the logic there.MattOn Wed, Jun 10, 2009 at 12:28 AM, Thai Son Cung

Here's what I did, which I suspect is *not* what you're talking about: org.codehaus.mojo SUCCESS [16.667s] [INFO] AppFuse Modular Application - Web (Struts 2) ...... Here's the link about 'excludes' config changing: http://old.nabble.com/-ANN--native2ascii-maven-plugin-1.0-beta-1-released-to32801307.html#a32801307Then I also found this thread by you, Matt, which seems to indicate there's a problem with file encoding or something along those lines? I was able to create the archetype without issue but running "mvn" from my new modular project's top level directory failed with the error below.

SUCCESS [2.320s] > [INFO] AppFuse Modular Application - Core ................ If you reply to this email, your message will be added to the discussion below: http://appfuse.547863.n4.nabble.com/Error-starting-Sun-s-native2ascii-tp4654744p4655181.html To unsubscribe from Error starting Sun's native2ascii, click here. The reason this happened is probably because I chose *not* to use JRockit as my default JRE. Free forum by Nabble Edit this page [email protected] Discussion: AppFuse Build Error (too old to reply) Michael Goodell 2009-06-08 21:00:11 UTC PermalinkRaw Message Hello,First post here . . . .

please be kind..I am trying to run Hudson on an application built by AppFuse and keepgetting this error. Matt On Mon, Jun 8, 2009 at 3:00 PM, Michael Goodell [email protected] wrote: Hello, First post here . . . . share|improve this answer answered May 6 '14 at 7:45 tibi 303211 add a comment| Your Answer draft saved draft discarded Sign up or log in Sign up using Google Sign I've > > > >> > heard bad things about Spring and Hibernate in the past, so I don't > > > >> > know if they're causing this or what.

Is this thing a new addition? I will start with the most basic HelloWorld.java - so beginners can benefit from the process.Tip - Beginners should read the posts in the order in which they are written, from One thing i did notice when trying to get to the bottom of this problem was when running the tests with Suns JVM 1.5, the java.exe process, viewed using task manager, My guess is resources aren't being let go.