Contact Us

Home > No Such > Sys/cdefs.h No Such File

Sys/cdefs.h No Such File

Contents

Join them; it only takes a minute: Sign up ffMPEG “inttypes.h not found” error up vote 17 down vote favorite 1 While using the ffMPEG builds in Windows with Visual Studio Will be answering my own question soon. If the toolchain files are extracted from zipped file via archiver only for Windows, UNIX file permissions are lost. Since searching through the internet led me to wrong solutions, I thought I'd put up the right solution here so that people can find it easily. navigate here

Does this command work? I think Anaconda might be messing it up, still investigating. I don't see it failing in it's test compilation of pagespeed. It looks like __pyx_t_5numpy_int32_t is aliased to long *, which means cython is doing something weird. http://mail.millennium.berkeley.edu/pipermail/tinyos-help/2011-February/049796.html

Sys/cdefs.h No Such File

I am quite new to this project at this time. Infinite sum of logs puzzle Logical fallacy: X is bad, Y is worse, thus X is not bad more hot questions question feed default about us tour help blog chat data Any better way to determine source of light by analyzing the electromagnectic spectrum of the light Can a Legendary monster ignore a diviner's Portent and choose to pass the save anyway? Is "ANDROID_STANDALONE_TOOLCHAIN/sysroot/usr" directory exist? -> Yes: Go to next. / No: Check file permission of your original Android NDK header files, and libraries. 'make-standalone-toolchain.sh' script do not report error when the

I tackled it by installing the lost dependencies. Collaborator yarden commented Jan 12, 2015 If I remember correctly, I installed Python 2.7 through virtualenv, but it's also possible it was the default OS X one. visual-studio-2010 visual-c++ ffmpeg share|improve this question asked Nov 7 '12 at 9:33 Nav 6,072134887 add a comment| 2 Answers 2 active oldest votes up vote 36 down vote accepted The solution Inttypes.h Visual Studio 2010 I had never hadthis problem before, I think some files were probably overwritten bysystem updates./opt/tinyos-2.1.1/support/make/msp/msp.rulesCFLAGS += -I/usr/msp430/includeCFLAGS += -I/usr/lib/gcc-lib/msp430/3.2.3/includeJust beforeOBJCOPY = msp430-objcopyOBJDUMP = msp430-objdumpI found this solution on Google.

Why is absolute zero unattainable? crimsonwoods commented Mar 21, 2013 @monaka Android NDK toolchains are not linked with cygwin1.dll. It installs the compilers in /usr/bin. http://stackoverflow.com/questions/13266868/ffmpeg-inttypes-h-not-found-error Can you try out 05d3320, which I just pushed to the issue-30 branch, and tell me if that fixes the compile problem?

Sign in to comment Contact GitHub API Training Shop Blog About © 2016 GitHub, Inc. Inttypes.h Visual Studio 2012 I am afraid that those two header files are required to compile mruby. Anaconda is brought to you by Continuum Analytics. Can you try clang again?

Bits/c++config.h: No Such File Or Directory

A word like "inappropriate", with a less extreme connotation Cyberpunk story: Black samurai, skateboarding courier, Mafia selling pizza and Sumerian goddess as a computer virus UPDATE heap table -> Deadlocks on We recommend upgrading to the latest Safari, Google Chrome, or Firefox. Sys/cdefs.h No Such File Number of polynomials of degree less than 4 satisfying 5 points With the passing of Thai King Bhumibol, are there any customs/etiquette as a traveler I should be aware of? Fatal Error: Features.h: No Such File Or Directory Is "ANDROID_STANDALONE_TOOLCHAIN/sysroot/usr/include/stdlib.h" file exist? -> Yes: Please tell me your "command". "command" will be output on your shell, following the message "rake aborted!".

Is it from the OS X system install? check over here monaka commented Mar 20, 2013 There requires stdint.h even if your use the earliest version of mruby. But is this the right solution? Unpacking /Users/yarden/Software/pyhsmm Running setup.py (path:/var/folders/fk/qdjdmlm50pz_jt5lng_rkn480000gn/T/pip-oXTziG-build/setup.py) egg_info for package from file:///Users/yarden/Software/pyhsmm Installing collected packages: UNKNOWN Found existing installation: UNKNOWN 0.0.0 Uninstalling UNKNOWN: Successfully uninstalled UNKNOWN Running setup.py install for UNKNOWN building 'internals.hmm_messages_interface' Cdefs.h Download

Are independent variables really independent? You signed out in another tab or window. Perhaps you have some old developer tools installed? his comment is here That didn't work, so I reinstalled Anaconda and then it did.

I'm able to build this with clang on OS X 10.10 using the anaconda Python distribution. Inttypes.h Download If these build problems drive you nuts, it might be worth trying the Python-only versions.) Collaborator yarden commented Jan 13, 2015 I see, thanks for clarification. Can you try using anaconda?

jeffkaufman closed this Dec 30, 2013 Sign up for free to join this conversation on GitHub.

Join them; it only takes a minute: Sign up Python setup.py build cannot find standard include for gcc up vote 1 down vote favorite I'm trying to build some openmp based Personal Open source Business Explore Sign up Sign in Pricing Blog Support Search GitHub This repository Watch 223 Star 3,180 Fork 245 pagespeed/ngx_pagespeed Code Issues 196 Pull requests 9 Projects Why does the direction with highest eigenvalue have the largest semi-axis? Libc6-dev-i386 What can I do?What does "Fatal Python error: Py_Initialize: can't initialize sys standard streams LookupError: unknown encoding: x-MS950-HKSCS" mean?I am compiling a C source program to connect to MySQL database using

using ::llroundf; ~~^ /Developer/SDKs/MacOSX10.5.sdk/usr/include/architecture/i386/math.h:389:17: note: 'lroundf' declared here extern long int lroundf ( float ); ^ In file included from internals/hmm_messages_interface.cpp:240: In file included from internals/hmm_messages.h:4: In file included from deps/Eigen3/Eigen/Core:56: Linked 2 installing h5py through pip on windows 7 (linker error) 0 inttypes.h header issue Related 0Using ffMPEG on Windows with only the DLL's?1Building with Visual Studio 2010, MFC, and FFmpeg3FFmpeg I had never had this problem before, I think some files were probably overwritten by system updates. weblink using ::llround; ~~^ /Developer/SDKs/MacOSX10.5.sdk/usr/include/architecture/i386/math.h:388:17: note: 'lround' declared here extern long int lround ( double ); ^ In file included from internals/hmm_messages_interface.cpp:240: In file included from internals/hmm_messages.h:4: In file included from deps/Eigen3/Eigen/Core:56:

Reload to refresh your session. In file included from /usr/local/lib/gcc/x86_64-apple-darwin14.0.0/5.0.0/include/stdint.h:9:0, from /Developer/SDKs/MacOSX10.6.sdk/usr/include/inttypes.h:255, from /Applications/Canopy.app/appdata/canopy-1.5.2.2785.macosx-x86_64/Canopy.app/Contents/include/python2.7/pyport.h:9, from /Applications/Canopy.app/appdata/canopy-1.5.2.2785.macosx-x86_64/Canopy.app/Contents/include/python2.7/Python.h:58, from pynbody/sph/kd.h:4, from pynbody/sph/smooth.h:5, from pynbody/sph/smooth.cpp:6: /usr/local/lib/gcc/x86_64-apple-darwin14.0.0/5.0.0/include-fixed/stdint.h:27:32: fatal error: sys/_types/_int8_t.h: No such file or directory compilation terminated. mattjj closed this Jan 13, 2015 mattjj referenced this issue Nov 2, 2015 Closed Failed to install pyhsmm on Mac #52 Sign up for free to join this conversation on Personal Open source Business Explore Sign up Sign in Pricing Blog Support Search GitHub This repository Watch 35 Star 244 Fork 70 mattjj/pyhsmm Code Issues 5 Pull requests 0 Projects

A partial paste is below. (Sorry, Git is not giving me the option to reopen.) LD build/host/bin/mruby.exe CC tools/mirb/mirb.c -> build/host/tools/mirb/mirb.o LD build/host/bin/mirb.exe CC src/array.c -> build/androideabi/src/array.o In file included from Terms Privacy Security Status Help You can't perform that action at this time. Hot Network Questions How would a vagrant civilization evolve? It's also possible to make setup.py produce only C/C++ files without pyx.

build/temp.macosx-10.9-intel-2.7/internals/hmm_messages_interface.o -o /Users/yarden/Software/pyhsmm/internals/hmm_messages_interface.so building 'internals.hsmm_messages_interface' extension cc -fno-strict-aliasing -fno-common -dynamic -arch x86_64 -arch i386 -g -Os -pipe -fno-common -fno-strict-aliasing -fwrapv -DENABLE_DTRACE -DMACOSX -DNDEBUG -Wall -Wstrict-prototypes -Wshorten-64-to-32 -DNDEBUG -g -fwrapv -Os -Wall Reload to refresh your session. I'll try anaconda, though the nice thing about virtualenv is that I can control the versions of numpy/matplotlib/scipy/etc. Going to be away for 4 months, should we turn off the refrigerator or leave it on with water inside?

I would like your input please @masuidrive. There may be another solution more"pretty".Best regards.------------------------------Message: 1Date: Sat, 19 Feb 2011 23:27:30 +0000Subject: Re: [Tinyos-help] A lot of syntax errors when compile BlinkContent-Type: text/plain; charset=us-asciiHi,Post by Yanbo SHOU/usr/lib/ncc/deputy_nodeputy.h:4:20: error: stddef.h: It gave the helpful error message attached... Can an ATCo refuse to give service to an aircraft based on moral grounds?

monaka commented Mar 21, 2013 @crimsonwoods, I succeeded to build with your suggestion. There may be another solution more"pretty".Best regards.------------------------------Message: 1Date: Sat, 19 Feb 2011 23:27:30 +0000Subject: Re: [Tinyos-help] A lot of syntax errors when compile BlinkContent-Type: text/plain; charset=us-asciiHi,Post by Yanbo SHOU/usr/lib/ncc/deputy_nodeputy.h:4:20: error: stddef.h: I recursively cloned pyhsmm and then installed it in my local virtualenv, using: $ python setup.py build_ext --inplace which results in: $ python setup.py build_ext --inplace running build_ext building 'internals.hmm_messages_interface' extension Key bound to string does not handle some chars in string correctly What is the best way to upgrade gear in Diablo 3?

Skip to content Ignore Learn more Please note that GitHub no longer supports old versions of Firefox. I've resolved this problem by adding the following 2 lines in file: /opt/tinyos-2.1.1/support/make/msp/msp.rules CFLAGS += -I/usr/msp430/include CFLAGS += -I/usr/lib/gcc-lib/msp430/3.2.3/include Just before OBJCOPY = msp430-objcopy OBJDUMP = msp430-objdump I found this solution avoid building against the OS X python, which had some compiler flags that didn't seem to work with the int types used in this cython code, by using anaconda instead, and Collaborator yarden commented Jan 12, 2015 I'm using a local Python since this is all within a virtual environment: $ which python /Users/yarden/Software/pyenv/bin/python Owner mattjj commented Jan 12, 2015 Where'd that