Contact Us

Home > Not Found > Unistd.h Not Found Windows

Unistd.h Not Found Windows

Contents

I am trying to calculate number of items times the cost using a function.1 points · 3 comments Lost on pointers, can someone help my understanding?2 points · 6 comments FIFO Container with ability to Im testing a litle program using SRGP, but im getting the following errors: gcc -fpcc-struct-return -I/usr/include/srgp -O2 claseuno.c \ -L/usr/X11R6/lib -lsrgp -lX11 -lm -lpthread -unistd -o claseuno In file included from Reload to refresh your session. I'm thinking that might be part of the problem Any ideas? this content

I'll say it immediately, I have Xcode AND the command-line tools installed. For example, /Library or /System/Library? –Alex Reynolds Mar 30 '15 at 23:29 find / -name unistd.h finds files only in /Applications/Xcode/*, and I tried to get by without using Do the showrunners consider Supergirl to be part of the Arrowverse? EDIT : With the clang++ -stdlib=libc++ image.cpp command, I get this : clang++ -stdlib=libc++ image.cpp In file included from image.cpp:1: In file included from ./image.hpp:4: In file included from ./figure.hpp:4: In Discover More

Unistd.h Not Found Windows

Perhaps you can find an alternative; for example, there's no way you need unistd.h to compile a "Hello world" program! make[1]: *** [Utils.o] Error 1 make: *** [sub-common-make_first-ordered] Error 2 01:09:34: The process "/usr/bin/make" exited with code 2. Home Qt Development General and Desktop [SOLVED] XCode 7 and Qt error [SOLVED] XCode 7 and Qt error This topic has been deleted.

How do I explain that this is a terrible idea? make[1]: *** [Common.o] Error 1 make[1]: *** Waiting for unfinished jobs.... 1 error generated. share|improve this answer edited Jun 25 '14 at 21:09 answered Jun 25 '14 at 20:10 Boog 303412 Hi, I understand this is a fairly old question, but I'd be Unistd.h Not Found Mac Does the recent news of "ten times more galaxies" imply that there is correspondingly less dark matter?

comment:2 follow-up: ↓ 4 Changed 18 months ago by [email protected]… I'll 2nd Ryan's post: 1) I'm guessing you updated to the new Xcode, but didn't get the CLI tools. Unistd.h Windows Download more hot questions question feed lang-cpp about us tour help blog chat data legal privacy policy work here advertising info mobile contact us feedback Technology Life / Arts Culture / Recreation How to deal with players rejecting the question premise How do computers remember where they store things? internet Im posting the code below ,if you wanna give it a try, im gonna try your solution anyway , thanks!. #include "srgp.h" #undef unsleep //#include "unistd.h" #include "stdio.h" #include "stdlib.h" #include

In the United States is racial, ethnic, or national preference an acceptable hiring practice for departments or companies in some situations? Unistd.h Visual Studio 2015 Thanks in advance ! It is a POSIX header. If you need to fix it yourself, remove the include and see which functions are actually needed, then try to find a Windows equivalent.

Unistd.h Windows Download

How many lawn gnomes do I have? Now if you do ls /Applications/Xcode.app/Contents/Developer/Platforms/ on the terminal you will find multiple sdk kits so how do we then add these kits to the .pro file to support the platform Unistd.h Not Found Windows Posting in the Forums implies acceptance of the Terms and Conditions. Unistd.h File Not Found Mac -commandlinetools Both are required for MacPorts.

c++ osx clang llvm unistd.h share|improve this question edited Mar 30 '15 at 23:06 Lightness Races in Orbit 217k35336583 asked Mar 30 '15 at 22:42 user4664340 1 You need to news Cheers! I haven't found yet any solution in the net? In file included from /Applications/Xcode.app/Contents/Developer/Toolchains/XcodeDefault.xctoolchain/usr/bin/../include/c++/v1/iostream:37: /Applications/Xcode.app/Contents/Developer/Toolchains/XcodeDefault.xctoolchain/usr/bin/../include/c++/v1/__config:23:10: fatal error: 'unistd.h' file not found #include ^ 1 error generated. Unistd.h Windows Replacement

But i have the following problem when using root in python:import ROOTTraceback (most recent call last): File "", line 1, in File "/Users/mm/root/lib/ROOT.py", line 24, in import cppyy File asked 11 months ago viewed 804 times Related 108Is there a replacement for unistd.h for Windows (Visual C)?1Compile with Clang++ ignores CMAKE_INCLUDE_PATH0The command line clang/clang++ doesn't work on MacBook Air 2012 When I go check the clang logs, here's what I have : In file included from ./point.hpp:4: In file included from /usr/local/Cellar/llvm/3.6.2/bin/../include/c++/v1/iostream:37: /usr/local/Cellar/llvm/3.6.2/bin/../include/c++/v1/__config:23:10: fatal error: 'unistd.h' file not found #include http://vgadownload.com/not-found/no-message-found-for-trailer-not-found.html Anyway, if i comment the "unistd.h" include directive, and all functions related to it the error dissapears....its an open suse unistd.h wrong or what?, Thanx Reply With Quote 11-Sep-2008,01:33 #2 ken_yap

As a result, your viewing experience will be diminished, and you have been placed in read-only mode. Fatal Error: Unistd.h: No Such File Or Directory Please ​clean and try again. When I create an "external build system" project in Xcode and properly set POCO_BASE and PROJECT_BASE, I cannot compile my code.

c++ emacs header clang++ unistd.h share|improve this question edited Nov 19 '15 at 2:23 asked Nov 19 '15 at 0:40 Maxime Briand 163 Could you solve the problem by

Please post bug reports in Jira. XCode generates a ton of environment variables and passes them to the shell where make runs. Chances are there's an #ifdef around the platform specific parts and you just need to provide the right definitions to select the right platform. –Retired Ninja Mar 28 '14 at 6:58 Fatal Error: 'unistd.h' File Not Found If Dumbledore is the most powerful wizard (allegedly), why would he work at a glorified boarding school?

Reply Quote 0 wozza last edited by @Hercule it seems that if we do QMAKE_MAC_SDK = iphoneos you can then deploy to the iphone Reply Quote 0 froncer last edited by Terms Privacy Security Status Help You can't perform that action at this time. The error comes from a boost header, but unistd.h is a standard system header and it should be in /usr/include. check my blog For me, it looks like my xcode had gotten an year out of date ... –Rob Apr 22 at 16:02 add a comment| 2 Answers 2 active oldest votes up vote

Please upgrade Xcode. share|improve this answer answered Mar 28 '14 at 6:38 Tony D 72.6k891152 Thanks a lot for your response, I have at final followed this proposition. –user3471387 Mar 28 '14 it's work thanks.... :) Reply Quote 0 Hercule last edited by @Leandro @Leandro said: ls /Applications/Xcode.app/Contents/Developer/Platforms/MacOSX.platform/Developer/SDKs/ Great idea!